{"text_format":"1","workbook":"xlsx","n_sheets":5,"sheets":["MASTERLIST RISK","Risk Codes","Compatibility Report","Data","Data 2"],"not_rendered":{"charts":0,"images":0,"macros":1,"external_links":0,"defined_names":13,"comments":1,"pivot_tables":0},"unopened":[],"bounds":{"document_bytes":16777216,"sheet_cells":100000,"rows_first":2000,"rows_last":500,"rows_between":2000,"halvings":0,"cell_chars":16384,"cell_head_chars":4096},"cells_cut":0,"cells_raw":0,"read":"whole","date_system":"1900"}

{"sheet":"MASTERLIST RISK","index":0,"n_rows":78,"n_cols":36,"rows_kept":78,"cut":false,"hidden":false,"merged":[[62,19,68,19],[48,18,54,18],[62,21,68,21],[62,23,68,23],[41,24,47,24],[41,32,47,32],[41,18,47,18],[41,23,47,23],[55,9,61,9],[68,12,68,16],[62,10,67,10],[62,17,68,17],[62,24,68,24],[62,25,67,25],[55,21,61,21],[62,18,68,18],[41,19,47,19],[41,21,47,21],[41,25,46,25],[47,27,47,31],[55,10,60,10],[48,10,53,10],[48,17,54,17],[48,19,54,19],[48,21,54,21],[48,24,54,24],[48,25,53,25],[41,10,46,10],[47,12,47,16],[54,12,54,16],[55,25,60,25],[55,23,61,23],[55,24,61,24],[61,27,61,31],[48,23,54,23],[55,19,61,19],[41,0,47,0],[41,2,47,2],[41,3,47,3],[41,4,47,4],[41,5,47,5],[41,6,47,6],[41,7,47,7],[41,8,47,8],[41,9,47,9],[34,0,40,0],[34,2,40,2],[34,3,40,3],[34,4,40,4],[34,5,40,5],[34,6,40,6],[34,7,40,7],[40,27,40,31],[34,18,40,18],[34,19,40,19],[34,17,40,17],[34,10,39,10],[34,8,40,8],[34,9,40,9],[40,12,40,16],[34,25,39,25],[34,21,40,21],[34,23,40,23],[34,24,40,24],[27,0,33,0],[27,2,33,2],[27,3,33,3],[27,4,33,4],[27,5,33,5],[20,17,26,17],[20,19,26,19],[20,21,26,21],[20,10,25,10],[26,12,26,16],[20,0,26,0],[20,2,26,2],[20,3,26,3],[20,4,26,4],[20,5,26,5],[20,6,26,6],[20,7,26,7],[20,8,26,8],[27,19,33,19],[13,21,19,21],[6,0,12,0],[13,32,19,32],[13,8,19,8],[13,9,19,9],[13,17,19,17],[13,19,19,19],[13,10,18,10],[19,12,19,16],[6,21,12,21],[6,23,12,23],[6,24,12,24],[6,6,12,6],[6,7,12,7],[6,8,12,8],[6,9,12,9],[6,10,11,10],[6,17,12,17],[6,19,12,19],[13,1,19,1],[6,2,12,2],[6,3,12,3],[12,12,12,16],[4,0,4,6],[4,7,4,21],[5,10,5,16],[6,4,12,4],[6,5,12,5],[13,3,19,3],[20,23,26,23],[20,24,26,24],[27,21,33,21],[27,23,33,23],[27,17,33,17],[13,0,19,0],[13,2,19,2],[4,23,4,31],[5,25,5,31],[13,23,19,23],[13,24,19,24],[27,24,33,24],[13,4,19,4],[13,5,19,5],[33,27,33,31],[6,1,12,1],[13,6,19,6],[13,7,19,7],[55,8,61,8],[27,6,33,6],[27,7,33,7],[27,8,33,8],[27,9,33,9],[27,10,32,10],[33,12,33,16],[6,18,12,18],[13,18,19,18],[20,18,26,18],[27,18,33,18],[20,9,26,9],[61,12,61,16],[55,18,61,18],[55,17,61,17],[41,17,47,17],[75,27,75,31],[48,5,54,5],[48,6,54,6],[48,7,54,7],[48,8,54,8],[48,9,54,9],[62,0,68,0],[62,2,68,2],[62,3,68,3],[62,4,68,4],[62,5,68,5],[62,6,68,6],[62,7,68,7],[62,8,68,8],[62,9,68,9],[55,2,61,2],[55,3,61,3],[55,4,61,4],[48,2,54,2],[48,3,54,3],[48,4,54,4],[55,5,61,5],[55,6,61,6],[55,7,61,7],[69,8,75,8],[69,9,75,9],[69,19,75,19],[69,21,75,21],[69,23,75,23],[69,24,75,24],[69,25,74,25],[75,12,75,16],[69,18,75,18],[77,2,77,24],[55,34,61,34],[62,34,68,34],[69,34,75,34],[6,34,12,34],[13,34,19,34],[20,34,26,34],[27,34,33,34],[34,34,40,34],[41,34,47,34],[48,34,54,34],[62,32,68,32],[62,33,68,33],[69,32,75,32],[69,33,75,33],[48,32,54,32],[48,33,54,33],[6,32,12,32],[6,33,12,33],[68,27,68,31],[69,10,74,10],[69,17,75,17],[69,7,75,7],[54,27,54,31],[1,0,1,34],[20,1,26,1],[27,1,33,1],[34,1,40,1],[41,1,47,1],[48,1,54,1],[55,1,61,1],[62,1,68,1],[69,1,75,1],[55,0,61,0],[48,0,54,0],[6,25,11,25],[12,27,12,31],[13,25,18,25],[19,27,19,31],[20,25,25,25],[26,27,26,31],[27,25,32,25],[69,0,75,0],[69,2,75,2],[69,3,75,3],[69,4,75,4],[69,5,75,5],[69,6,75,6],[62,35,68,35],[69,35,75,35],[4,32,4,35],[6,35,12,35],[13,35,19,35],[20,35,26,35],[27,35,33,35],[34,35,40,35],[41,35,47,35],[48,35,54,35],[55,35,61,35],[13,33,19,33],[20,32,26,32],[20,33,26,33],[27,32,33,32],[27,33,33,33],[34,33,40,33],[34,32,40,32],[41,33,47,33],[55,32,61,32],[55,33,61,33]]}
[]
["         TEMPLATE_RISK REGISTER                                                                                                                                                                                                                                                                                                                                                                                  \n                                                                             \n          KCDIO: _________________________________________",null,null,null,null,null,null,null,null,null,null,null,null,null,null,null,null,null,null,null,null,null,null,null,null,null,null,null,null,null,null,null,null,null,null,"VERSION  : 01\n REVISION : 02"]
[]
[]
[" 1. BASIC RISK INFORMATION",null,null,null,null,null,null,"2. RISK ASSESSMENT INFORMATION (\"AS IS\"/BEFORE PROPOSED MITIGATION)",null,null,null,null,null,null,null,null,null,null,null,null,null,null,null,"3. RISK ASSESSMENT INFORMATION (AFTER MITIGATION)",null,null,null,null,null,null,null,null,"4. MONITORING & CONTROL"]
["Risk Number","Issue(s)","Risk  Description / Risk Event Statement","Risk Category","Risk Owner","Date Reported \nday-month-year","Last Update\nday-month-year","Impact Description","Impact\n1 / 2 / 3 / 4 / 5","Likelihood\n1 / 2 / 3 /4 / 5","Risk Matrix",null,null,null,null,null,null,"Risk Mitigation Strategy","Existing Control","Proposed Mitigation / Control Actions","Target Date (Completion of the Mitigation Plan)","Impact Description (after mitigation)","Opportunities (After the Mitigation Plan is Implemented)","Impact\n1 / 2 / 3 / 4 / 5","Likelihood\n1 / 2 / 3 /4 / 5","Risk Rating",null,null,null,null,null,null,"Interval or Milestone Check and Remarks","Action Owner","Risk Status","Remarks (Effectiveness of the Mitigation Plan)"]
[null,null,null,null,null,null,null,null,null,null,"Likelihood",5,{"$f":"IF(AND(I7=\"1 (Insignificant)\",J7=\"5 (Almost Certain)\")=TRUE,\"x\",\" \")","v":" "},{"$f":"IF(AND(I7=\"2 (Minor)\",J7=\"5 (Almost Certain)\")=TRUE,\"x\",\" \")","v":" "},{"$f":"IF(AND(I7=\"3 (Moderate)\",J7=\"5 (Almost Certain)\")=TRUE,\"x\",\" \")","v":" "},{"$f":"IF(AND(I7=\"4 (Major)\",J7=\"5 (Almost Certain)\")=TRUE,\"x\",\" \")","v":" "},{"$f":"IF(AND(I7=\"5 (Catastrophic)\",J7=\"5 (Almost Certain)\")=TRUE,\"x\",\" \")","v":" "},null,null,null,null,null,null,null,null,"Likelihood",5,{"$f":"IF(AND(X7=\"1 (Insignificant)\",Y7=\"5 (Almost Certain)\")=TRUE,\"x\",\" \")","v":" "},{"$f":"IF(AND(X7=\"2 (Minor)\",Y7=\"5 (Almost Certain)\")=TRUE,\"x\",\" \")","v":" "},{"$f":"IF(AND(X7=\"3 (Moderate)\",Y7=\"5 (Almost Certain)\")=TRUE,\"x\",\" \")","v":" "},{"$f":"IF(AND(X7=\"4 (Major)\",Y7=\"5 (Almost Certain)\")=TRUE,\"x\",\" \")","v":" "},{"$f":"IF(AND(X7=\"5 (Catastrophic)\",Y7=\"5 (Almost Certain)\")=TRUE,\"x\",\" \")","v":" "}]
[null,null,null,null,null,null,null,null,null,null,null,4,{"$f":"IF(AND(I7=\"1 (Insignificant)\",J7=\"4 (Likely)\")=TRUE,\"x\",\" \")","v":" "},{"$f":"IF(AND(I7=\"2 (Minor)\",J7=\"4 (Likely)\")=TRUE,\"x\",\" \")","v":" "},{"$f":"IF(AND(I7=\"3 (Moderate)\",J7=\"4 (Likely)\")=TRUE,\"x\",\" \")","v":" "},{"$f":"IF(AND(I7=\"4 (Major)\",J7=\"4 (Likely)\")=TRUE,\"x\",\" \")","v":" "},{"$f":"IF(AND(I7=\"5 (Catastrophic)\",J7=\"4 (Likely)\")=TRUE,\"x\",\" \")","v":" "},null,null,null,null,null,null,null,null,null,4,{"$f":"IF(AND(X7=\"1 (Insignificant)\",Y7=\"4 (Likely)\")=TRUE,\"x\",\" \")","v":" "},{"$f":"IF(AND(X7=\"2 (Minor)\",Y7=\"4 (Likely)\")=TRUE,\"x\",\" \")","v":" "},{"$f":"IF(AND(X7=\"3 (Moderate)\",Y7=\"4 (Likely)\")=TRUE,\"x\",\" \")","v":" "},{"$f":"IF(AND(X7=\"4 (Major)\",Y7=\"4 (Likely)\")=TRUE,\"x\",\" \")","v":" "},{"$f":"IF(AND(X7=\"5 (Catastrophic)\",Y7=\"4 (Likely)\")=TRUE,\"x\",\" \")","v":" "}]
[null,null,null,null,null,null,null,null,null,null,null,3,{"$f":"IF(AND(I7=\"1 (Insignificant)\",J7=\"3 (Possible)\")=TRUE,\"x\",\" \")","v":" "},{"$f":"IF(AND(I7=\"2 (Minor)\",J7=\"3 (Possible)\")=TRUE,\"x\",\" \")","v":" "},{"$f":"IF(AND(I7=\"3 (Moderate)\",J7=\"3 (Possible)\")=TRUE,\"x\",\" \")","v":" "},{"$f":"IF(AND(I7=\"4 (Major)\",J7=\"3 (Possible)\")=TRUE,\"x\",\" \")","v":" "},{"$f":"IF(AND(I7=\"5 (Catastrophic)\",J7=\"3 (Possible)\")=TRUE,\"x\",\" \")","v":" "},null,null,null,null,null,null,null,null,null,3,{"$f":"IF(AND(X7=\"1 (Insignificant)\",Y7=\"3 (Possible)\")=TRUE,\"x\",\" \")","v":" "},{"$f":"IF(AND(X7=\"2 (Minor)\",Y7=\"3 (Possible)\")=TRUE,\"x\",\" \")","v":" "},{"$f":"IF(AND(X7=\"3 (Moderate)\",Y7=\"3 (Possible)\")=TRUE,\"x\",\" \")","v":" "},{"$f":"IF(AND(X7=\"4 (Major)\",Y7=\"3 (Possible)\")=TRUE,\"x\",\" \")","v":" "},{"$f":"IF(AND(X7=\"5 (Catastrophic)\",Y7=\"3 (Possible)\")=TRUE,\"x\",\" \")","v":" "}]
[null,null,null,null,null,null,null,null,null,null,null,2,{"$f":"IF(AND(I7=\"1 (Insignificant)\",J7=\"2 (Unlikely)\")=TRUE,\"x\",\" \")","v":" "},{"$f":"IF(AND(I7=\"2 (Minor)\",J7=\"2 (Unlikely)\")=TRUE,\"x\",\" \")","v":" "},{"$f":"IF(AND(I7=\"3 (Moderate)\",J7=\"2 (Unlikely)\")=TRUE,\"x\",\" \")","v":" "},{"$f":"IF(AND(I7=\"4 (Major)\",J7=\"2 (Unlikely)\")=TRUE,\"x\",\" \")","v":" "},{"$f":"IF(AND(I7=\"5 (Catastrophic)\",J7=\"2 (Unlikely)\")=TRUE,\"x\",\" \")","v":" "},null,null,null,null,null,null,null,null,null,2,{"$f":"IF(AND(X7=\"1 (Insignificant)\",Y7=\"2 (Unlikely)\")=TRUE,\"x\",\" \")","v":" "},{"$f":"IF(AND(X7=\"2 (Minor)\",Y7=\"2 (Unlikely)\")=TRUE,\"x\",\" \")","v":" "},{"$f":"IF(AND(X7=\"3 (Moderate)\",Y7=\"2 (Unlikely)\")=TRUE,\"x\",\" \")","v":" "},{"$f":"IF(AND(X7=\"4 (Major)\",Y7=\"2 (Unlikely)\")=TRUE,\"x\",\" \")","v":" "},{"$f":"IF(AND(X7=\"5 (Catastrophic)\",Y7=\"2 (Unlikely)\")=TRUE,\"x\",\" \")","v":" "}]
{"$rows_left_out":69}
{"sheet":"Risk Codes","index":1,"n_rows":74,"n_cols":7,"rows_kept":74,"cut":false,"hidden":false,"merged":[[69,2,69,3],[70,2,70,3],[71,2,71,3],[72,2,72,3],[73,2,73,3],[55,2,55,3],[53,2,54,3],[66,2,66,3],[64,2,64,3],[65,2,65,3],[56,2,56,3],[57,2,57,3],[62,2,62,3],[63,2,63,3],[58,2,58,3],[10,2,10,3],[21,2,21,6],[43,2,43,6],[52,2,52,3],[9,2,9,3],[11,2,11,3],[2,1,2,6],[5,2,5,3],[6,2,6,3],[7,2,7,3],[8,2,8,3]]}
[null,"Risk Management"]
[]
[null,"Each risk has been rated in terms of it’s resulting likelihood of occurrence and the potential impact, using the rating system specified in AS/NZ STANDARD 4360:2004 Risk Management.  These are explained in the tables below."]
[]
[null,"Table 1 - Risk Category"]
[null,"Type","Description"]
[null,"Strategic","Losses due to error or misjudgement in the selection of strategy or the execution of the strategy or exposure to loss resulting from a strategy that turns out to be defective or inappropriate"]
[null,"Operations","Risk arising from execution of a company's business function which focuses on the risks arising from the people, assets, systems and processes through which the University operates"]
[null,"Finance","Risk associated with the finances of the Universityy, including loan interest charges, echange rates, taxation, borrowings & credit, government grant, error in asset valuation  (over or undervaluation), liabilitiies, spending beyond limit, negative cash flows or any other direct and indirect losses affecting other elemnets of the University's finances"]
[null,"Reputation","Risk of impact to the business attribute/related to the trustworthiness of the business and/or the education industry as a whole"]
{"$rows_left_out":65}
{"sheet":"Compatibility Report","index":2,"n_rows":8,"n_cols":6,"rows_kept":8,"cut":false,"hidden":false,"merged":[]}
[null,"Compatibility Report for Risk Template 09032017-v1.xls"]
[null,"Run on 8/3/2017 22:44"]
[]
[null,"The following features in this workbook are not supported by earlier versions of Excel. These features may be lost or degraded when opening this workbook in an earlier version of Excel or if you save this workbook in an earlier file format."]
[]
[null,"Minor loss of fidelity",null,null,"# of occurrences","Version"]
[]
[null,"Some cells or styles in this workbook contain formatting that is not supported by the selected file format. These formats will be converted to the closest format available.",null,null,18,"Excel 97-2003"]

{"sheet":"Data","index":3,"n_rows":34,"n_cols":7,"rows_kept":34,"cut":false,"hidden":false,"merged":[]}
[null,null,0,4,9,14,24]
[null,null,4,9,14,24,25]
["Risk Factor","Risk Rating","1-4 (low)","5-9 (Medium)","10-14 (Significant)","15-24 (Major)","25 (Extreme)"]
[{"$f":"OFFSET('MASTERLIST RISK'!$A$7,(ROW()-4)*7,0)","v":0},{"$f":"_xlfn.IFS(OFFSET('MASTERLIST RISK'!$M$11,(ROW()-4)*7,0)=\"x\",1,OFFSET('MASTERLIST RISK'!$N$11,(ROW()-4)*7,0)=\"x\",2,OFFSET('MASTERLIST RISK'!$O$11,(ROW()-4)*7,0)=\"x\",3,OFFSET('MASTERLIST RISK'!$P$11,(ROW()-4)*7,0)=\"x\",4,OFFSET('MASTERLIST RISK'!$Q$11,(ROW()-4)*7,0)=\"x\",4,OFFSET('MASTERLIST RISK'!$M$10,(ROW()-4)*7,0)=\"x\",2,OFFSET('MASTERLIST RISK'!$N$10,(ROW()-4)*7,0)=\"x\",4,OFFSET('MASTERLIST RISK'!$O$10,(ROW()-4)*7,0)=\"x\",6,OFFSET('MASTERLIST RISK'!$P$10,(ROW()-4)*7,0)=\"x\",8,OFFSET('MASTERLIST RISK'!$Q$10,(ROW()-4)*7,0)=\"x\",10,OFFSET('MASTERLIST RISK'!$M$9,(ROW()-4)*7,0)=\"x\",3,OFFSET('MASTERLIST RISK'!$N$9,(ROW()-4)*7,0)=\"x\",6,OFFSET('MASTERLIST RISK'!$O$9,(ROW()-4)*7,0)=\"x\",9,OFFSET('MASTERLIST RISK'!$P$9,(ROW()-4)*7,0)=\"x\",12,OFFSET('MASTERLIST RISK'!$Q$9,(ROW()-4)*7,0)=\"x\",15,OFFSET('MASTERLIST RISK'!$M$8,(ROW()-4)*7,0)=\"x\",4,OFFSET('MASTERLIST RISK'!$N$8,(ROW()-4)*7,0)=\"x\",8,OFFSET('MASTERLIST RISK'!$O$8,(ROW()-4)*7,0)=\"x\",12,OFFSET('MASTERLIST RISK'!$P$8,(ROW()-4)*7,0)=\"x\",16,OFFSET('MASTERLIST RISK'!$Q$8,(ROW()-4)*7,0)=\"x\",20,OFFSET('MASTERLIST RISK'!$M$7,(ROW()-4)*7,0)=\"x\",5,OFFSET('MASTERLIST RISK'!$N$7,(ROW()-4)*7,0)=\"x\",10,OFFSET('MASTERLIST RISK'!$O$7,(ROW()-4)*7,0)=\"x\",15,OFFSET('MASTERLIST RISK'!$P$7,(ROW()-4)*7,0)=\"x\",20,OFFSET('MASTERLIST RISK'!$Q$7,(ROW()-4)*7,0)=\"x\",25)","v":{"$error":"#N/A"}},{"$f":"IF(AND(C$1<$B4,$B4<=C$2),$B4,\"\")","v":{"$error":"#N/A"}},{"$error":"#N/A"},{"$error":"#N/A"},{"$error":"#N/A"},{"$error":"#N/A"}]
[{"$f":"OFFSET('MASTERLIST RISK'!$A$7,(ROW()-4)*7,0)","v":0},{"$f":"_xlfn.IFS(OFFSET('MASTERLIST RISK'!$M$11,(ROW()-4)*7,0)=\"x\",1,OFFSET('MASTERLIST RISK'!$N$11,(ROW()-4)*7,0)=\"x\",2,OFFSET('MASTERLIST RISK'!$O$11,(ROW()-4)*7,0)=\"x\",3,OFFSET('MASTERLIST RISK'!$P$11,(ROW()-4)*7,0)=\"x\",4,OFFSET('MASTERLIST RISK'!$Q$11,(ROW()-4)*7,0)=\"x\",4,OFFSET('MASTERLIST RISK'!$M$10,(ROW()-4)*7,0)=\"x\",2,OFFSET('MASTERLIST RISK'!$N$10,(ROW()-4)*7,0)=\"x\",4,OFFSET('MASTERLIST RISK'!$O$10,(ROW()-4)*7,0)=\"x\",6,OFFSET('MASTERLIST RISK'!$P$10,(ROW()-4)*7,0)=\"x\",8,OFFSET('MASTERLIST RISK'!$Q$10,(ROW()-4)*7,0)=\"x\",10,OFFSET('MASTERLIST RISK'!$M$9,(ROW()-4)*7,0)=\"x\",3,OFFSET('MASTERLIST RISK'!$N$9,(ROW()-4)*7,0)=\"x\",6,OFFSET('MASTERLIST RISK'!$O$9,(ROW()-4)*7,0)=\"x\",9,OFFSET('MASTERLIST RISK'!$P$9,(ROW()-4)*7,0)=\"x\",12,OFFSET('MASTERLIST RISK'!$Q$9,(ROW()-4)*7,0)=\"x\",15,OFFSET('MASTERLIST RISK'!$M$8,(ROW()-4)*7,0)=\"x\",4,OFFSET('MASTERLIST RISK'!$N$8,(ROW()-4)*7,0)=\"x\",8,OFFSET('MASTERLIST RISK'!$O$8,(ROW()-4)*7,0)=\"x\",12,OFFSET('MASTERLIST RISK'!$P$8,(ROW()-4)*7,0)=\"x\",16,OFFSET('MASTERLIST RISK'!$Q$8,(ROW()-4)*7,0)=\"x\",20,OFFSET('MASTERLIST RISK'!$M$7,(ROW()-4)*7,0)=\"x\",5,OFFSET('MASTERLIST RISK'!$N$7,(ROW()-4)*7,0)=\"x\",10,OFFSET('MASTERLIST RISK'!$O$7,(ROW()-4)*7,0)=\"x\",15,OFFSET('MASTERLIST RISK'!$P$7,(ROW()-4)*7,0)=\"x\",20,OFFSET('MASTERLIST RISK'!$Q$7,(ROW()-4)*7,0)=\"x\",25)","v":{"$error":"#N/A"}},{"$error":"#N/A"},{"$error":"#N/A"},{"$error":"#N/A"},{"$error":"#N/A"},{"$error":"#N/A"}]
[{"$f":"OFFSET('MASTERLIST RISK'!$A$7,(ROW()-4)*7,0)","v":0},{"$f":"_xlfn.IFS(OFFSET('MASTERLIST RISK'!$M$11,(ROW()-4)*7,0)=\"x\",1,OFFSET('MASTERLIST RISK'!$N$11,(ROW()-4)*7,0)=\"x\",2,OFFSET('MASTERLIST RISK'!$O$11,(ROW()-4)*7,0)=\"x\",3,OFFSET('MASTERLIST RISK'!$P$11,(ROW()-4)*7,0)=\"x\",4,OFFSET('MASTERLIST RISK'!$Q$11,(ROW()-4)*7,0)=\"x\",4,OFFSET('MASTERLIST RISK'!$M$10,(ROW()-4)*7,0)=\"x\",2,OFFSET('MASTERLIST RISK'!$N$10,(ROW()-4)*7,0)=\"x\",4,OFFSET('MASTERLIST RISK'!$O$10,(ROW()-4)*7,0)=\"x\",6,OFFSET('MASTERLIST RISK'!$P$10,(ROW()-4)*7,0)=\"x\",8,OFFSET('MASTERLIST RISK'!$Q$10,(ROW()-4)*7,0)=\"x\",10,OFFSET('MASTERLIST RISK'!$M$9,(ROW()-4)*7,0)=\"x\",3,OFFSET('MASTERLIST RISK'!$N$9,(ROW()-4)*7,0)=\"x\",6,OFFSET('MASTERLIST RISK'!$O$9,(ROW()-4)*7,0)=\"x\",9,OFFSET('MASTERLIST RISK'!$P$9,(ROW()-4)*7,0)=\"x\",12,OFFSET('MASTERLIST RISK'!$Q$9,(ROW()-4)*7,0)=\"x\",15,OFFSET('MASTERLIST RISK'!$M$8,(ROW()-4)*7,0)=\"x\",4,OFFSET('MASTERLIST RISK'!$N$8,(ROW()-4)*7,0)=\"x\",8,OFFSET('MASTERLIST RISK'!$O$8,(ROW()-4)*7,0)=\"x\",12,OFFSET('MASTERLIST RISK'!$P$8,(ROW()-4)*7,0)=\"x\",16,OFFSET('MASTERLIST RISK'!$Q$8,(ROW()-4)*7,0)=\"x\",20,OFFSET('MASTERLIST RISK'!$M$7,(ROW()-4)*7,0)=\"x\",5,OFFSET('MASTERLIST RISK'!$N$7,(ROW()-4)*7,0)=\"x\",10,OFFSET('MASTERLIST RISK'!$O$7,(ROW()-4)*7,0)=\"x\",15,OFFSET('MASTERLIST RISK'!$P$7,(ROW()-4)*7,0)=\"x\",20,OFFSET('MASTERLIST RISK'!$Q$7,(ROW()-4)*7,0)=\"x\",25)","v":{"$error":"#N/A"}},{"$error":"#N/A"},{"$error":"#N/A"},{"$error":"#N/A"},{"$error":"#N/A"},{"$error":"#N/A"}]
[{"$f":"OFFSET('MASTERLIST RISK'!$A$7,(ROW()-4)*7,0)","v":0},{"$f":"_xlfn.IFS(OFFSET('MASTERLIST RISK'!$M$11,(ROW()-4)*7,0)=\"x\",1,OFFSET('MASTERLIST RISK'!$N$11,(ROW()-4)*7,0)=\"x\",2,OFFSET('MASTERLIST RISK'!$O$11,(ROW()-4)*7,0)=\"x\",3,OFFSET('MASTERLIST RISK'!$P$11,(ROW()-4)*7,0)=\"x\",4,OFFSET('MASTERLIST RISK'!$Q$11,(ROW()-4)*7,0)=\"x\",4,OFFSET('MASTERLIST RISK'!$M$10,(ROW()-4)*7,0)=\"x\",2,OFFSET('MASTERLIST RISK'!$N$10,(ROW()-4)*7,0)=\"x\",4,OFFSET('MASTERLIST RISK'!$O$10,(ROW()-4)*7,0)=\"x\",6,OFFSET('MASTERLIST RISK'!$P$10,(ROW()-4)*7,0)=\"x\",8,OFFSET('MASTERLIST RISK'!$Q$10,(ROW()-4)*7,0)=\"x\",10,OFFSET('MASTERLIST RISK'!$M$9,(ROW()-4)*7,0)=\"x\",3,OFFSET('MASTERLIST RISK'!$N$9,(ROW()-4)*7,0)=\"x\",6,OFFSET('MASTERLIST RISK'!$O$9,(ROW()-4)*7,0)=\"x\",9,OFFSET('MASTERLIST RISK'!$P$9,(ROW()-4)*7,0)=\"x\",12,OFFSET('MASTERLIST RISK'!$Q$9,(ROW()-4)*7,0)=\"x\",15,OFFSET('MASTERLIST RISK'!$M$8,(ROW()-4)*7,0)=\"x\",4,OFFSET('MASTERLIST RISK'!$N$8,(ROW()-4)*7,0)=\"x\",8,OFFSET('MASTERLIST RISK'!$O$8,(ROW()-4)*7,0)=\"x\",12,OFFSET('MASTERLIST RISK'!$P$8,(ROW()-4)*7,0)=\"x\",16,OFFSET('MASTERLIST RISK'!$Q$8,(ROW()-4)*7,0)=\"x\",20,OFFSET('MASTERLIST RISK'!$M$7,(ROW()-4)*7,0)=\"x\",5,OFFSET('MASTERLIST RISK'!$N$7,(ROW()-4)*7,0)=\"x\",10,OFFSET('MASTERLIST RISK'!$O$7,(ROW()-4)*7,0)=\"x\",15,OFFSET('MASTERLIST RISK'!$P$7,(ROW()-4)*7,0)=\"x\",20,OFFSET('MASTERLIST RISK'!$Q$7,(ROW()-4)*7,0)=\"x\",25)","v":{"$error":"#N/A"}},{"$error":"#N/A"},{"$error":"#N/A"},{"$error":"#N/A"},{"$error":"#N/A"},{"$error":"#N/A"}]
[{"$f":"OFFSET('MASTERLIST RISK'!$A$7,(ROW()-4)*7,0)","v":0},{"$f":"_xlfn.IFS(OFFSET('MASTERLIST RISK'!$M$11,(ROW()-4)*7,0)=\"x\",1,OFFSET('MASTERLIST RISK'!$N$11,(ROW()-4)*7,0)=\"x\",2,OFFSET('MASTERLIST RISK'!$O$11,(ROW()-4)*7,0)=\"x\",3,OFFSET('MASTERLIST RISK'!$P$11,(ROW()-4)*7,0)=\"x\",4,OFFSET('MASTERLIST RISK'!$Q$11,(ROW()-4)*7,0)=\"x\",4,OFFSET('MASTERLIST RISK'!$M$10,(ROW()-4)*7,0)=\"x\",2,OFFSET('MASTERLIST RISK'!$N$10,(ROW()-4)*7,0)=\"x\",4,OFFSET('MASTERLIST RISK'!$O$10,(ROW()-4)*7,0)=\"x\",6,OFFSET('MASTERLIST RISK'!$P$10,(ROW()-4)*7,0)=\"x\",8,OFFSET('MASTERLIST RISK'!$Q$10,(ROW()-4)*7,0)=\"x\",10,OFFSET('MASTERLIST RISK'!$M$9,(ROW()-4)*7,0)=\"x\",3,OFFSET('MASTERLIST RISK'!$N$9,(ROW()-4)*7,0)=\"x\",6,OFFSET('MASTERLIST RISK'!$O$9,(ROW()-4)*7,0)=\"x\",9,OFFSET('MASTERLIST RISK'!$P$9,(ROW()-4)*7,0)=\"x\",12,OFFSET('MASTERLIST RISK'!$Q$9,(ROW()-4)*7,0)=\"x\",15,OFFSET('MASTERLIST RISK'!$M$8,(ROW()-4)*7,0)=\"x\",4,OFFSET('MASTERLIST RISK'!$N$8,(ROW()-4)*7,0)=\"x\",8,OFFSET('MASTERLIST RISK'!$O$8,(ROW()-4)*7,0)=\"x\",12,OFFSET('MASTERLIST RISK'!$P$8,(ROW()-4)*7,0)=\"x\",16,OFFSET('MASTERLIST RISK'!$Q$8,(ROW()-4)*7,0)=\"x\",20,OFFSET('MASTERLIST RISK'!$M$7,(ROW()-4)*7,0)=\"x\",5,OFFSET('MASTERLIST RISK'!$N$7,(ROW()-4)*7,0)=\"x\",10,OFFSET('MASTERLIST RISK'!$O$7,(ROW()-4)*7,0)=\"x\",15,OFFSET('MASTERLIST RISK'!$P$7,(ROW()-4)*7,0)=\"x\",20,OFFSET('MASTERLIST RISK'!$Q$7,(ROW()-4)*7,0)=\"x\",25)","v":{"$error":"#N/A"}},{"$error":"#N/A"},{"$error":"#N/A"},{"$error":"#N/A"},{"$error":"#N/A"},{"$error":"#N/A"}]
[{"$f":"OFFSET('MASTERLIST RISK'!$A$7,(ROW()-4)*7,0)","v":0},{"$f":"_xlfn.IFS(OFFSET('MASTERLIST RISK'!$M$11,(ROW()-4)*7,0)=\"x\",1,OFFSET('MASTERLIST RISK'!$N$11,(ROW()-4)*7,0)=\"x\",2,OFFSET('MASTERLIST RISK'!$O$11,(ROW()-4)*7,0)=\"x\",3,OFFSET('MASTERLIST RISK'!$P$11,(ROW()-4)*7,0)=\"x\",4,OFFSET('MASTERLIST RISK'!$Q$11,(ROW()-4)*7,0)=\"x\",4,OFFSET('MASTERLIST RISK'!$M$10,(ROW()-4)*7,0)=\"x\",2,OFFSET('MASTERLIST RISK'!$N$10,(ROW()-4)*7,0)=\"x\",4,OFFSET('MASTERLIST RISK'!$O$10,(ROW()-4)*7,0)=\"x\",6,OFFSET('MASTERLIST RISK'!$P$10,(ROW()-4)*7,0)=\"x\",8,OFFSET('MASTERLIST RISK'!$Q$10,(ROW()-4)*7,0)=\"x\",10,OFFSET('MASTERLIST RISK'!$M$9,(ROW()-4)*7,0)=\"x\",3,OFFSET('MASTERLIST RISK'!$N$9,(ROW()-4)*7,0)=\"x\",6,OFFSET('MASTERLIST RISK'!$O$9,(ROW()-4)*7,0)=\"x\",9,OFFSET('MASTERLIST RISK'!$P$9,(ROW()-4)*7,0)=\"x\",12,OFFSET('MASTERLIST RISK'!$Q$9,(ROW()-4)*7,0)=\"x\",15,OFFSET('MASTERLIST RISK'!$M$8,(ROW()-4)*7,0)=\"x\",4,OFFSET('MASTERLIST RISK'!$N$8,(ROW()-4)*7,0)=\"x\",8,OFFSET('MASTERLIST RISK'!$O$8,(ROW()-4)*7,0)=\"x\",12,OFFSET('MASTERLIST RISK'!$P$8,(ROW()-4)*7,0)=\"x\",16,OFFSET('MASTERLIST RISK'!$Q$8,(ROW()-4)*7,0)=\"x\",20,OFFSET('MASTERLIST RISK'!$M$7,(ROW()-4)*7,0)=\"x\",5,OFFSET('MASTERLIST RISK'!$N$7,(ROW()-4)*7,0)=\"x\",10,OFFSET('MASTERLIST RISK'!$O$7,(ROW()-4)*7,0)=\"x\",15,OFFSET('MASTERLIST RISK'!$P$7,(ROW()-4)*7,0)=\"x\",20,OFFSET('MASTERLIST RISK'!$Q$7,(ROW()-4)*7,0)=\"x\",25)","v":{"$error":"#N/A"}},{"$error":"#N/A"},{"$error":"#N/A"},{"$error":"#N/A"},{"$error":"#N/A"},{"$error":"#N/A"}]
[{"$f":"OFFSET('MASTERLIST RISK'!$A$7,(ROW()-4)*7,0)","v":0},{"$f":"_xlfn.IFS(OFFSET('MASTERLIST RISK'!$M$11,(ROW()-4)*7,0)=\"x\",1,OFFSET('MASTERLIST RISK'!$N$11,(ROW()-4)*7,0)=\"x\",2,OFFSET('MASTERLIST RISK'!$O$11,(ROW()-4)*7,0)=\"x\",3,OFFSET('MASTERLIST RISK'!$P$11,(ROW()-4)*7,0)=\"x\",4,OFFSET('MASTERLIST RISK'!$Q$11,(ROW()-4)*7,0)=\"x\",4,OFFSET('MASTERLIST RISK'!$M$10,(ROW()-4)*7,0)=\"x\",2,OFFSET('MASTERLIST RISK'!$N$10,(ROW()-4)*7,0)=\"x\",4,OFFSET('MASTERLIST RISK'!$O$10,(ROW()-4)*7,0)=\"x\",6,OFFSET('MASTERLIST RISK'!$P$10,(ROW()-4)*7,0)=\"x\",8,OFFSET('MASTERLIST RISK'!$Q$10,(ROW()-4)*7,0)=\"x\",10,OFFSET('MASTERLIST RISK'!$M$9,(ROW()-4)*7,0)=\"x\",3,OFFSET('MASTERLIST RISK'!$N$9,(ROW()-4)*7,0)=\"x\",6,OFFSET('MASTERLIST RISK'!$O$9,(ROW()-4)*7,0)=\"x\",9,OFFSET('MASTERLIST RISK'!$P$9,(ROW()-4)*7,0)=\"x\",12,OFFSET('MASTERLIST RISK'!$Q$9,(ROW()-4)*7,0)=\"x\",15,OFFSET('MASTERLIST RISK'!$M$8,(ROW()-4)*7,0)=\"x\",4,OFFSET('MASTERLIST RISK'!$N$8,(ROW()-4)*7,0)=\"x\",8,OFFSET('MASTERLIST RISK'!$O$8,(ROW()-4)*7,0)=\"x\",12,OFFSET('MASTERLIST RISK'!$P$8,(ROW()-4)*7,0)=\"x\",16,OFFSET('MASTERLIST RISK'!$Q$8,(ROW()-4)*7,0)=\"x\",20,OFFSET('MASTERLIST RISK'!$M$7,(ROW()-4)*7,0)=\"x\",5,OFFSET('MASTERLIST RISK'!$N$7,(ROW()-4)*7,0)=\"x\",10,OFFSET('MASTERLIST RISK'!$O$7,(ROW()-4)*7,0)=\"x\",15,OFFSET('MASTERLIST RISK'!$P$7,(ROW()-4)*7,0)=\"x\",20,OFFSET('MASTERLIST RISK'!$Q$7,(ROW()-4)*7,0)=\"x\",25)","v":{"$error":"#N/A"}},{"$error":"#N/A"},{"$error":"#N/A"},{"$error":"#N/A"},{"$error":"#N/A"},{"$error":"#N/A"}]
{"$rows_left_out":25}
{"sheet":"Data 2","index":4,"n_rows":7,"n_cols":16,"rows_kept":7,"cut":false,"hidden":false,"merged":[]}
["please choose from the drop down list"]
["Strategic","1 (Insignificant)","1 (Rare)",null,null,null,null,"Accept","Open",null,null,"1 (Insignificant)","1 (Rare)",null,null,"low"]
["Operations","2 (Minor)","2 (Unlikely)",null,null,null,null,"Transfer","Closed",null,null,"2 (Minor)","2 (Unlikely)",null,null,"medium"]
["Finance","3 (Moderate)","3 (Possible)",null,null,null,null,"Reduce","In-progress",null,null,"3 (Moderate)","3 (Possible)",null,null,"significant"]
["Reputation","4 (Major)","4 (Likely)",null,null,null,null,"Avoid","Monitoring",null,null,"4 (Major)","4 (Likely)",null,null,"high"]
["Information","5 (Catastrophic)","5 (Almost Certain)",null,null,null,null,null,null,null,null,"5 (Catastrophic)","5 (Almost Certain)",null,null,"Extreme"]
["Regulation"]